{"text_format":"1","workbook":"xlsx","n_sheets":13,"sheets":["Introducción","Medidas para la reapertura","Información sobre las escuelas","Estado reapertura de escuelas","Monto de los recursos","Precios de los recursos","Calculadoras","Financiamiento","Informe","Artículos que se deben adquirir","Data prep","List_Economy","Output"],"not_rendered":{"charts":3,"images":33,"macros":1,"external_links":1,"defined_names":128,"comments":2,"pivot_tables":0},"unopened":[],"bounds":{"document_bytes":16777216,"sheet_cells":100000,"rows_first":2000,"rows_last":500,"rows_between":2000,"halvings":0,"cell_chars":16384,"cell_head_chars":4096},"cells_cut":0,"cells_raw":0,"read":"whole","date_system":"1900"}

{"sheet":"Introducción","index":0,"n_rows":51,"n_cols":16,"rows_kept":51,"cut":false,"hidden":false,"merged":[[22,7,22,9],[22,15,22,17],[50,2,50,17],[19,4,19,5],[20,4,20,5],[21,4,21,5],[22,4,22,5],[21,15,21,17],[19,7,19,9],[20,7,20,9],[19,11,19,13],[41,2,41,17],[26,2,26,17],[37,2,37,4],[38,2,38,17],[19,15,19,17],[21,7,21,9],[6,2,6,17],[0,2,0,17],[1,2,1,17],[5,2,5,17],[13,7,13,9],[13,11,13,13],[13,15,13,17],[11,11,11,13],[11,15,11,17],[13,4,13,5],[11,7,11,9],[7,2,7,17],[14,7,14,9],[14,11,14,13],[16,11,16,13],[15,11,15,13],[14,4,14,5],[15,4,15,5],[16,4,16,5],[15,7,15,9],[16,7,16,9],[17,4,17,5],[18,4,18,5],[18,11,18,13],[20,11,20,13],[17,11,17,13],[17,7,17,9],[18,7,18,9]]}
[" ",null,"Versión 1.0\n22 de noviembre 2021"]
[null,null,"Herramienta de cálculo de costos para planes de reapertura de escuelas"]
[null,null,"Introducción"]
[]
[null,null,"1. ¿Para qué sirve esta herramienta?"]
[null,null,"Propósitos\n i) Identificar los recursos adicionales y la intensidad de uso necesaria para llevar a cabo el plan de reapertura de escuelas;\nii) calcular el costo de estos recursos adicionales y especificar el financiamiento disponible;\niii) evaluar si existe una brecha de financiamiento, y\niv) guiar la implementación del plan de reapertura de escuelas. "]
[null,null,"Destinatarios\nLa información generada por la herramienta le será útil a funcionarios de gobierno, dirigentes escolares, organizaciones y donantes internacionales implicados en la planificación, presupuestación y financiamiento de la reapertura de escuelas durante la pandemia. "]
[null,null,"Usuarios\nSugerimos que las personas que completen las planillas sean funcionarios de gobierno o dirigentes escolares encargados de calcular los presupuestos para la reapertura de escuelas. Normalmente estas personas trabajan en la unidad de presupuesto. Los investigadores, organizaciones internacionales y donantes también pueden utilizar la herramienta para proporcionar asistencia técnica a los gobiernos. "]
[]
[null,null,"2. ¿Cuáles son los componentes de la herramienta?"]
[]
[null,null,null,null,null,null,null,"Propósito de la planilla",null,null,null,"Entrada",null,null,null,"Salida"]
[]
[null,null,null,null,"Introducción",null,null,"Describe el propósito de la herramienta y cómo utilizarla"]
[null,null,null,null,"Medidas previstas para la reapertura",null,null,"Proporciona una lista de las medidas que contribuyen a garantizar la seguridad de las operaciones, mantener el aprendizaje, respaldar el bienestar emocional y llegar a los marginados."]
{"$rows_left_out":37}
{"sheet":"Medidas para la reapertura","index":1,"n_rows":22,"n_cols":9,"rows_kept":22,"cut":false,"hidden":false,"merged":[]}
[]
[]
[]
[]
[]
[null,null,null,null,"<Indicar si las medidas aplican a todas las escuelas o a las escuelas reabiertas cuando están codificadas por color>"]
[null,null,"Medidas","Explicación de las medidas","Aplican a","Consecuencias financieras",null," "]
[null,null,"Eje 1:  medidas relacionadas con la seguridad de las operaciones"]
[null,null,"Establecer medidas de limpieza y desinfección","Programar la limpieza periódica de las instalaciones educativas. Limpiar y desinfectar las aulas y los espacios utilizados para la instrucción, espacios comunes, gimnasios, baños, así como superficies que se tocan con frecuencia como picaportes, escritorios, juguetes, insumos, interruptores de luz, marcos de puertas, equipos de juego, material didáctico utilizado por los niños y portadas de los libros. ","Escuelas reabiertas","Aumento en el costo",null,null,"P101"]
[null,null,"Proporcionar equipos de protección personal ","Hacer cumplir la política de la escuela de utilizar una mascarilla o una máscara, en línea con las directrices nacionales o locales. Proporcionar suficientes mascarillas para los alumnos y el personal. Presentarles a los alumnos con problemas sensoriales o sensibilidades táctiles las máscaras que sean más cómodas para ellos. ","Escuelas reabiertas","Aumento en el costo",null,null,"P102"]
[null,null,"Proporcionar materiales para higienizar las manos","Crear una rutina frecuente para la higienización de manos, en especial para los niños pequeños. Asegurarse que las estrategias de lavado de manos incluyan el lavado con agua y jabón durante al menos 20 segundos. Se deben proporcionar estaciones para el lavado o higiene de manos en las entradas de las escuelas y a lo largo de las instalaciones escolares (p. ej., entradas y salidas de los gimnasios e instalaciones deportivas, baños, comedor y aulas). ","Escuelas reabiertas","Aumento en el costo",null,null,"P103"]
[null,null,"Establecer barreras y guías físicas","Instalar barreras físicas como barreras para estornudos y mamparas. Proporcionar guías físicas, como bandas pintadas en el piso o en la acera y señales en las paredes (como guías para generar “vías de un solo sentido” en los pasillos). Agregar barreras físicas, como pantallas de plástico flexible, entre los lavabos del baño, especialmente cuando no están a un mínimo de dos metros de distancia. ","Escuelas reabiertas","Aumento en el costo",null,null,"P108"]
[null,null,"Eje 2: medidas para sostener el aprendizaje"]
[null,null,"Posibilitar el desarrollo profesional de los docentes.","Posibilitar un desarrollo profesional que sea más práctico y orientado a cumplir con ciertas necesidades específicas de instrucción por parte de los docentes, por ejemplo capacitación sobre cómo utilizar computadoras para el dictado de clases. ","Escuelas reabiertas","Aumento en el costo",null,null,"P201"]
[null,null,"Mantener los enfoques flexibles o parciales de aprendizaje remoto","Mantener las prácticas de aprendizaje remoto mediante métodos combinados donde sea necesario y factible (p. ej., algunos grupos de alumnos pueden tomar clases en línea, aprender en casa a través de la asignación de tareas, blogs, realizar actividades físicas en el hogar). Si la educación a distancia no es posible, invitar a los alumnos a llevar sus libros de texto a casa o disponer lo necesario para enviar tareas. Tener en cuenta la emisión de clases por radio o TV, establecer un sistema de tareas escolares en el hogar con la participación de hermanos mayores, o con amigos por teléfono. ","Todas las escuelas, independientemente de su estado de reapertura","Aumento en el costo",null,null,"P202"]
{"$rows_left_out":8}
{"sheet":"Información sobre las escuelas","index":2,"n_rows":84,"n_cols":16,"rows_kept":84,"cut":false,"hidden":false,"merged":[[70,3,70,5],[41,3,41,5],[39,3,39,12],[44,2,44,12],[13,3,13,12],[16,3,16,12]]}
[]
[]
[]
[]
[null,null,null,null,null,null,null,"<Responda a las preguntas y complete las celdas de entrada>"]
[]
[null,null,"Información básica de las escuelas"]
[]
[null,null,"1. País",null,null,"Perú",null,"<Elija el país/economía de la lista desplegable>"]
[]
[null,null,"2. El plan de reapertura de escuelas al que se le debe calcular el costo"]
[]
[null,null,null,"1) Nombre del documento"]
[null,null,null,"Herramienta de costeo para IIEE nodo de Cusco y Ayacucho Horizontes"]
[]
{"$rows_left_out":70}
{"sheet":"Estado reapertura de escuelas","index":3,"n_rows":25,"n_cols":18,"rows_kept":25,"cut":false,"hidden":false,"merged":[[15,2,15,6],[7,2,7,18],[8,17,8,18],[18,2,18,18],[17,2,17,18],[11,2,11,6]]}
[]
[]
[]
[]
[]
[]
[null,null,{"$f":"\"Estado de reapertura de las escuelas durante \"&LOWER('Información sobre las escuelas'!D40)&\"\"","v":"Estado de reapertura de las escuelas durante 2022"}]
[null,null,"<Si las escuelas o los alumnos regresan a clases presenciales de forma escalonada, indique el porcentaje de escuelas que imparten clases presenciales, el porcentaje de alumnos que asisten a clases presenciales y el número de días de escuela para cada etapa. Caso contrario, solo complete los tres parámetros de la Fase 1.>"]
[null,null,null,null,null,null,null,"Fase 1",null,"Fase 2",null,"Fase 3",null,"Fase 4",null,"Fase 5",null,{"$f":"\"Promedio durante \"&LOWER('Información sobre las escuelas'!D40)&\"\"","v":"Promedio durante 2022"}]
[null,null,"Porcentaje de escuelas que imparten clases presenciales",null,null,null,null,1,null,null,null,null,null,null,null,null,null,{"$f":"IF(ISERROR((pct_school_reopen_phase1 * N_school_day_phase1 + pct_school_reopen_phase2 * N_school_day_phase2 + pct_school_reopen_phase3 * N_school_day_phase3 + pct_school_reopen_phase4 * N_school_day_phase4 + pct_school_reopen_phase5 * N_school_day_phase5)/(N_school_day_phase1 + N_school_day_phase2 + N_school_day_phase3 + N_school_day_phase4 + N_school_day_phase5)), \"\", (pct_school_reopen_phase1 * N_school_day_phase1 + pct_school_reopen_phase2 * N_school_day_phase2 + pct_school_reopen_phase3 * N_school_day_phase3 + pct_school_reopen_phase4 * N_school_day_phase4 + pct_school_reopen_phase5 * N_school_day_phase5)/(N_school_day_phase1 + N_school_day_phase2 + N_school_day_phase3 + N_school_day_phase4 + N_school_day_phase5))","v":1}]
[]
[null,null,"Porcentaje de alumnos que asisten a clases presenciales",null,null,null,null,null,null,null,null,null,null,null,null,null,null,{"$f":"IF( ISERROR((pct_student_in_school_phase1 * N_school_day_phase1 + pct_student_in_school_phase2 * N_school_day_phase2 + pct_student_in_school_phase3 * N_school_day_phase3 + pct_student_in_school_phase4 * N_school_day_phase4 + pct_student_in_school_phase5 * N_school_day_phase5)/(N_school_day_phase1 + N_school_day_phase2 + N_school_day_phase3 + N_school_day_phase4 + N_school_day_phase5)), \"\", (pct_student_in_school_phase1 * N_school_day_phase1 + pct_student_in_school_phase2 * N_school_day_phase2 + pct_student_in_school_phase3 * N_school_day_phase3 + pct_student_in_school_phase4 * N_school_day_phase4 + pct_student_in_school_phase5 * N_school_day_phase5)/(N_school_day_phase1 + N_school_day_phase2 + N_school_day_phase3 + N_school_day_phase4 + N_school_day_phase5))","v":0}]
[]
[null,null,"Cantidad de días de escuela (en días)*",null,null,null,null,180]
[]
{"$rows_left_out":11}
{"sheet":"Monto de los recursos","index":4,"n_rows":63,"n_cols":10,"rows_kept":63,"cut":false,"hidden":false,"merged":[[59,2,60,2],[27,3,28,3],[23,2,25,2],[26,2,33,2],[34,2,39,2],[30,3,31,3],[32,3,33,3],[34,3,35,3],[36,3,37,3],[48,3,49,3],[42,2,49,2],[50,2,53,2],[55,2,57,2],[42,3,43,3],[44,3,45,3],[6,4,6,5],[16,3,17,3],[8,2,22,2],[9,3,10,3],[11,3,12,3],[13,3,14,3],[18,3,19,3],[21,3,22,3]]}
[]
[]
[]
[]
[]
[null,null,null,null,null,"<Verifique si la configuración predeterminada tiene sentido para usted. Caso contrario, modifique según su contexto.>"]
[null,null,"Medidas verificadas","Recursos adicionales","Configuración de los parámetros",null,"Notas"]
[null,null,"Eje 1: medidas relacionadas con la seguridad de las operaciones"]
[null,null,"Establecer medidas de limpieza y desinfección","Desinfectante",null,"Ver Calculadora 1 para más detalles","1L por escuela x semana",null,null,"P101"]
[null,null,null,"Contenedores vacíos para diluir los productos de limpieza y desinfección",null,"contenedor(es) por personal de limpieza (objetivo)"]
[null,null,null,null,null,"contenedor(es) por personal de limpieza (disponibles ahora)","<Indicar la cantidad que dispone ahora>"]
[null,null,null,"Pulverizadores, atomizadores o rociadores para desinfectar",null,"pulverizador(es) por personal de limpieza (objetivo)"]
[null,null,null,null,null,"pulverizador(es) por personal de limpieza (disponibles ahora)","<Indicar la cantidad que dispone ahora>"]
[null,null,null,"Trapeadores, baldes y cepillos",null,"equipo(s) por aula/baño/oficina (objetivo)"]
[null,null,null,null,null,"equipo(s) por aula/baño/oficina (disponibles ahora)","<Indicar la cantidad que dispone ahora>"]
{"$rows_left_out":49}
{"sheet":"Precios de los recursos","index":5,"n_rows":51,"n_cols":10,"rows_kept":51,"cut":false,"hidden":false,"merged":[[13,3,14,3],[46,2,47,2],[42,2,44,2],[8,2,17,2],[18,2,20,2],[21,2,25,2],[26,2,29,2],[32,2,36,2],[37,2,40,2]]}
[]
[]
[]
[]
[]
[null,null,null,null,null,null,"<Ingresar el precio de cada recurso>"]
[null,null,"Medidas verificadas","Recursos adicionales","Cantidad","Unidad",{"$f":"\"Precio \"&IF('Información sobre las escuelas'!G80=\"\",\"\",\"(en \"&'Información sobre las escuelas'!G80&\")\"&\"\")","v":"Precio (en Soles)"},{"$f":"\"Presupuesto adicional\"","v":"Presupuesto adicional"}]
[null,null,"Eje 1: medidas relacionadas con la seguridad de las operaciones"]
[null,null,"Establecer medidas de limpieza y desinfección","Desinfectante (1L)",{"$f":"Disinfectant_per_school_per_day_gap * (N_school * pct_school_reopen) * N_school_days","v":{"$error":"#VALUE!"}},"litro(s)",null,{"$f":"E9*G9","v":{"$error":"#VALUE!"}},null,"P101"]
[null,null,null,"Contenedores vacíos para diluir los productos de limpieza y desinfección",{"$f":"N_container_per_cleaner * N_newly_hired_cleaner + (N_container_per_cleaner - N_container_per_cleaner_current) * N_cleaner_current * pct_teacher_staff_in_school","v":0},"pieza(s)",null,{"$f":"E10*G10","v":0}]
[null,null,null,"Pulverizador (1.5L)",{"$f":"N_sprayer_per_cleaner * N_newly_hired_cleaner + (N_sprayer_per_cleaner - N_sprayer_per_cleaner_current) * N_cleaner_current * pct_teacher_staff_in_school","v":0},"pieza(s)",null,0]
[null,null,null,"Trapeadores, baldes y cepillos",{"$f":"(N_mop_per_room - N_mop_per_room_current) * N_school * pct_school_reopen * N_room_per_school","v":{"$error":"#VALUE!"}},"conjunto(s)",null,{"$error":"#VALUE!"}]
[null,null,null,"Barras de jabón",{"$f":"N_soap_bar_per_room * N_room_per_school * N_school * pct_school_reopen","v":{"$error":"#VALUE!"}},"pieza(s)",null,{"$error":"#VALUE!"}]
[null,null,null,"Agua",{"$f":"Water_multiplier * N_school * pct_school_reopen","v":-1},"vez/veces x escuela(s)",null,0]
[null,null,null,null,{"$f":"'Monto de los recursos'!E18*N_school_days*N_school *pct_school_reopen","v":0},"barril(es) x escuela por todo el segundo semestre",null,{"$f":"G15*E15","v":0}]
{"$rows_left_out":37}
{"sheet":"Calculadoras","index":6,"n_rows":107,"n_cols":18,"rows_kept":107,"cut":false,"hidden":false,"merged":[[38,3,38,7],[31,11,31,17],[39,3,39,7],[18,11,18,17],[26,11,26,17],[26,3,26,7],[24,11,24,17],[18,3,18,7],[24,3,24,7],[82,2,82,17],[54,4,54,7],[55,4,55,7],[65,4,65,7],[66,4,66,7]]}
[]
[]
[]
[]
[null,null,null,null,null,null,null,null,null,null,null,null,"<Completar las celdas de entrada>"]
[]
[null,null,"Calculadoras"]
[]
[null,null,"Índice"]
[]
[null,null,null,{"$f":"C16","v":"Calculadora 1. Cómo calcular la cantidad de desinfectante necesario"}]
[null,null,null,{"$f":"C52","v":"Calculadora 2. Cómo calcular la cantidad de antiséptico y jabón líquido para el lavado de manos"}]
[null,null,null,{"$f":"C80","v":"Calculadora 3. Cómo calcular la cantidad de mascarillas"}]
[]
[]
{"$rows_left_out":93}
{"sheet":"Financiamiento","index":7,"n_rows":18,"n_cols":6,"rows_kept":18,"cut":false,"hidden":false,"merged":[]}
[]
[]
[]
[]
[null,null,"<Indique el financiamiento disponible de fuentes domésticas y externas y el porcentaje de financiamiento sujeto a reasignación>"]
[]
[null,null,"Fuente de financiamiento","Monto disponible","Porcentaje sujeto a reasignación","Financiamiento total"]
[null,null,"Ahorro derivado de cancelar las excursiones, eventos y actividades extracurriculares",null,null,{"$f":"D8*E8","v":0}]
[null,null,"Financiamiento externo",null,null,0]
[null,null,"Paquete de ayuda para la COVID-19",null,null,0]
[null,null,"Aportes de padres y madres de familia",null,null,0]
[null,null,null,null,null,0]
[null,null,null,null,null,{"$f":"D13*E13","v":0}]
[null,null,null,null,null,0]
[null,null,null,null,null,0]
{"$rows_left_out":4}
{"sheet":"Informe","index":8,"n_rows":42,"n_cols":8,"rows_kept":42,"cut":false,"hidden":false,"merged":[[8,7,8,17],[22,7,22,17],[41,2,41,17],[26,5,27,6],[26,4,27,4],[29,5,30,6],[29,4,30,4],[33,4,35,6],[9,7,9,17],[23,7,23,17]]}
[]
[]
[]
[]
[]
[]
[null,null,{"$f":"\"How much does it cost to reopen schools safely\"&IF('Información sobre las escuelas'!F9 <>\"\", \" in \"&'Información sobre las escuelas'!F9&\"\", \"\")&\"?\"","v":"How much does it cost to reopen schools safely in Perú?"}]
[]
[null,null,null,null,"Contexto",null,null,{"$f":"\"Costo, financiamiento y brecha financiera de reabrir las escuelas de forma segura durante el segundo semestre de \"&LOWER('Información sobre las escuelas'!D40)&\"\"","v":"Costo, financiamiento y brecha financiera de reabrir las escuelas de forma segura durante el segundo semestre de 2022"}]
[null,null,null,null,{"$f":"CHOOSE(Output!C3, Output!C4, Output!C5, Output!C6, Output!C7, Output!C8)","v":"Moises Moreno Romero"},null,null,{"$f":"\"(Expresado en \"&'Información sobre las escuelas'!G80&\" del \"&'Información sobre las escuelas'!G82&\")\"","v":"(Expresado en Soles del 2022)"}]
[]
[null,null,null,null,"Niveles educativos"]
[null,null,null,null,{"$f":"IF(Output!J3 = TRUE, Output!L3, \"\")","v":""}]
[null,null,null,{"$f":"_xlfn.ANCHORARRAY(Output!N3)","v":"Educación secundaria (1ro-5to)"},{"$f":"IF(Output!J4 = TRUE, Output!L4, \"\")","v":""}]
[null,null,null,null,{"$f":"IF(Output!J5 = TRUE, Output!L5, \"\")","v":"Educación secundaria (1ro-5to)"}]
{"$rows_left_out":28}
{"sheet":"Artículos que se deben adquirir","index":9,"n_rows":32,"n_cols":7,"rows_kept":32,"cut":false,"hidden":false,"merged":[]}
[]
[]
[]
[]
[]
[null,null,"<Se genera automáticamente una lista con los materiales y equipos que deben adquirirse. La cantidad representa las necesidades totales, NO los recursos adicionales necesarios>"]
[null,null,"Artículos que se deben adquirir (materiales y equipos)","Cantidad","Unidad"]
[null,null,"Desinfectante (1L)",{"$f":"Disinfectant_per_school_per_day * (N_school * pct_school_reopen) * N_school_days","v":{"$error":"#VALUE!"}},"litro(s)",null,"p101"]
[null,null,"Contenedores vacíos para diluir los productos de limpieza y desinfección",{"$f":"N_container_per_cleaner * N_newly_hired_cleaner + (N_container_per_cleaner - N_container_per_cleaner_current) * N_cleaner_current * pct_teacher_staff_in_school","v":0},"pieza(s)"]
[null,null,"Pulverizador (1.5L)",{"$f":"N_sprayer_per_cleaner * N_newly_hired_cleaner + (N_sprayer_per_cleaner - N_sprayer_per_cleaner_current) * N_cleaner_current * pct_teacher_staff_in_school","v":0},"pieza(s)"]
[null,null,"Trapeadores, baldes y cepillos",{"$f":"(N_mop_per_room - N_mop_per_room_current) * N_school * N_room_per_school * pct_teacher_staff_in_school","v":{"$error":"#VALUE!"}},"conjunto(s)"]
[null,null,"Barras de jabón",{"$f":"N_soap_bar_per_room * N_room_per_school * N_school * pct_school_reopen","v":{"$error":"#VALUE!"}},"pieza(s)"]
[null,null,"Guantes de goma para el personal de limpieza",{"$f":"N_glove_per_cleaner * N_newly_hired_cleaner + (N_glove_per_cleaner - N_glove_per_cleaner_current) * N_cleaner_current * pct_teacher_staff_in_school","v":0},"par(es)"]
[null,null,"Batas desechables para el personal de limpieza",{"$f":"N_disposable_gown_per_cleaner_per_day * N_cleaner * pct_school_reopen * N_school_days","v":0},"conjunto(s)"]
[null,null,"Batas y gorras reutilizables para el personal de limpieza",{"$f":"N_reusable_gown_per_cleaner * N_newly_hired_cleaner + (N_reusable_gown_per_cleaner - N_reusable_gown_per_cleaner_current) * N_cleaner_current * pct_teacher_staff_in_school","v":0},"conjunto(s)"]
{"$rows_left_out":18}
{"sheet":"Data prep","index":10,"n_rows":34,"n_cols":4,"rows_kept":34,"cut":false,"hidden":true,"merged":[]}
[]
["Financial cost"]
[null,"Total additional cost"]
["Safe operations",{"$f":"_xlfn.AGGREGATE(9, 5, 'Precios de los recursos'!H9:H30)","v":{"$error":"#VALUE!"}}]
["Sustaining learning",{"$f":"_xlfn.AGGREGATE(9, 5, 'Precios de los recursos'!H32:H41)","v":0}]
["Supporting emotional wellbeing",{"$f":"_xlfn.AGGREGATE(9, 5, 'Precios de los recursos'!H43:H48)","v":0}]
["Reaching the marginalized",{"$f":"_xlfn.AGGREGATE(9, 5, 'Precios de los recursos'!H50:H50)","v":0}]
["Total",{"$f":"SUM(B4:B7)","v":{"$error":"#VALUE!"}}]
[]
[null,"Total"]
["Additional cost",{"$f":"B8","v":{"$error":"#VALUE!"}}]
["Additional funding available",{"$f":"_xlfn.AGGREGATE(9, 5, Financiamiento!F8:F18)","v":0}]
["Funding gap",{"$f":"B11-B12","v":{"$error":"#VALUE!"}}]
[]
["Figure 1"]
{"$rows_left_out":20}
{"sheet":"List_Economy","index":11,"n_rows":290,"n_cols":11,"rows_kept":290,"cut":false,"hidden":true,"merged":[[274,0,274,8],[278,0,278,8],[280,0,280,8]]}
["Lista de economías del Banco Mundial (junio de 2020)"]
[]
["(Las negritas indican un cambio en la clasificación)",null,null," "]
[]
["x","x","Economía","Code","X","Region","Income group","Lending category","Other",null,"Data prep"]
["x","x","x","x","x","x","x","x","x"]
[1,null,"Afganistán","AFG",null,"South Asia","Low income","IDA","HIPC",null,{"$f":"_xlfn._xlws.FILTER($C$7:$C$225, ISNUMBER(SEARCH('Información sobre las escuelas'!F9, $C$7:$C$225)),\"Please check the spelling\")","v":"Perú"}]
[2,null,"Albania","ALB",null,"Europe & Central Asia","Upper middle income","IBRD",""]
[3,null,"Alemania","DZA",null,"Middle East & North Africa","Lower middle income","IBRD",""]
[4,null,"Andorra","ASM",null,"East Asia & Pacific","Upper middle income","..",""]
[5,null,"Angola","AND",null,"Europe & Central Asia","High income","..",""]
[6,null,"Antigua y Barbuda","AGO",null,"Sub-Saharan Africa","Lower middle income","IBRD"]
[7,null,"Arabia Saudita","ATG",null,"Latin America & Caribbean","High income","IBRD",""]
[8,null,"Argelia","ARG",null,"Latin America & Caribbean","Upper middle income","IBRD",""]
[9,null,"Argentina","ARM",null,"Europe & Central Asia","Upper middle income","IBRD",""]
{"$rows_left_out":276}
{"sheet":"Output","index":12,"n_rows":17,"n_cols":14,"rows_kept":17,"cut":false,"hidden":true,"merged":[]}
["Spreadsheet","Measures","Basic school information","Basic school information","Basic school information","Basic school information","Basic school information",null,null,"Report"]
["Parameter","Applicable to","Location","Education level: Pre-primary education","Education level: Primary education","Education level:  secondary education","Education level: Tertiary education","Private school included",null,"Education levels","Label of education level","Education level + grade level",null,"Filter list"]
["Value",null,5,false,false,true,false,2,null,{"$f":"D3","v":false},"Educación preescolar",{"$f":"_xlfn.CONCAT(K3, \" (\", 'Información sobre las escuelas'!G32, \")\")","v":"Educación preescolar ()"},null,{"$f":"_xlfn._xlws.FILTER(L3:L6, J3:J6 = TRUE, \"\")","v":"Educación secundaria (1ro-5to)"}]
[1,"Todas las escuelas, independientemente de su estado de reapertura",{"$f":"'Información sobre las escuelas'!F9","v":"Perú"},"educación preescolar,","educación primaria,","educación secundaria,","educación terciaria",null,null,{"$f":"E3","v":false},"Educación primaria",{"$f":"_xlfn.CONCAT(K4, \" (\", 'Información sobre las escuelas'!G33, \")\")","v":"Educación primaria ()"}]
[2,"Escuelas reabiertas",{"$f":"'Información sobre las escuelas'!G24","v":0},null,null,null,null,null,null,{"$f":"F3","v":true},"Educación secundaria",{"$f":"_xlfn.CONCAT(K5, \" (\", 'Información sobre las escuelas'!G34, \")\")","v":"Educación secundaria (1ro-5to)"}]
[3,null,{"$f":"'Información sobre las escuelas'!G25","v":0},null,null,null,null,null,null,{"$f":"G3","v":false},"Educación terciaria",{"$f":"_xlfn.CONCAT(K6, \" (\", 'Información sobre las escuelas'!G36, \")\")","v":"Educación terciaria ()"}]
[4,null,{"$f":"'Información sobre las escuelas'!G26","v":0}]
[5,null,{"$f":"'Información sobre las escuelas'!G27","v":"Moises Moreno Romero"}]
[6]
[7]
[8]
[9]
[10]
[]
[]
{"$rows_left_out":2}