{"text_format":"1","workbook":"xlsx","n_sheets":14,"sheets":["Instructions for translation","Introduction","Planned measures for reopening","Basic information about schools","School reopening status","Qty of additional resources","Calculators","Prices of additional resources","Funding","Report","Items to purchase","Data prep","Output","List_Economy"],"not_rendered":{"charts":6,"images":36,"macros":1,"external_links":1,"defined_names":218,"comments":2,"pivot_tables":0},"unopened":[],"bounds":{"document_bytes":16777216,"sheet_cells":100000,"rows_first":2000,"rows_last":500,"rows_between":2000,"halvings":0,"cell_chars":16384,"cell_head_chars":4096},"cells_cut":0,"cells_raw":0,"read":"whole","date_system":"1900"}

{"sheet":"Instructions for translation","index":0,"n_rows":61,"n_cols":4,"rows_kept":61,"cut":false,"hidden":false,"merged":[]}
[]
["Instructions for Translation"]
[]
["Total number of English words for translation"]
[{"$f":"SUM(Introduction!C56, 'Planned measures for reopening'!C40, 'Basic information about schools'!C107, 'School reopening status'!C24, 'Qty of additional resources'!C131, Calculators!C235, 'Prices of additional resources'!C101, Funding!C23, Report!C58, 'Items to purchase'!C51, 'Data prep'!A38, Output!A16, List_Economy!C287)","v":8862}]
[]
["How to translate the names of the tabs?"]
["1. Replace the English tab names with the translation"]
["2. Update macros"]
["    1) Under the ribbon \"Developer\" -> Click on \"View Code\" -> Click on \"Sheet 6 (Planned measures for reopening)\" -> Replace each English tab name with its translation"]
{"$rows_left_out":52}
{"sheet":"Introduction","index":1,"n_rows":56,"n_cols":16,"rows_kept":56,"cut":false,"hidden":false,"merged":[[17,4,17,5],[18,4,18,5],[18,11,18,13],[20,11,20,13],[17,11,17,13],[17,7,17,9],[18,7,18,9],[16,11,16,13],[15,11,15,13],[14,4,14,5],[15,4,15,5],[16,4,16,5],[15,7,15,9],[16,7,16,9],[19,15,19,17],[21,7,21,9],[6,2,6,17],[0,2,0,17],[1,2,1,17],[5,2,5,17],[13,7,13,9],[13,11,13,13],[13,15,13,17],[11,11,11,13],[11,15,11,17],[13,4,13,5],[11,7,11,9],[7,2,7,17],[14,7,14,9],[14,11,14,13],[22,7,22,9],[22,15,22,17],[50,2,50,17],[19,4,19,5],[20,4,20,5],[21,4,21,5],[22,4,22,5],[21,15,21,17],[19,7,19,9],[20,7,20,9],[19,11,19,13],[41,2,41,17],[26,2,26,17],[37,2,37,4],[38,2,38,17],[40,2,40,3]]}
[" ",null,"Version 1.0\nAugust 17, 2021"]
[null,null,"Costing Tool for School Reopening and Learning Recovery"]
[null,null,"Introduction"]
[]
[null,null,"1. What is this tool for?"]
[null,null,"Purposes\ni) Estimate the cost of implementing measures to ensure the safety of the education community, recover learning, and support the emotional wellbeing of children, while reaching the most marginalized populations; \nii) Identify sources of additional funding;\niii) Estimate funding gaps, if relevant; and\niv) guide the implementation of school reopening and learning recovery. "]
[null,null,"Audience\nInformation generated from the tool would be useful for government officials, school leaders, international organizations and donors who are involved in the planning, budgeting, and financing of school reopening and learning recovery during and after the pandemic. "]
[null,null,"Users\nWe recommend that government officials or school leaders who are assigned to budgeting and planning for school reopening would collect the data needed for the tool and fill out the spreadsheets. Researchers, international organizations, donors, and foundations can also use the tool to provide technical assistance to governments and to estimate the costs of interventions implemented in response to the COVID-19 pandemic. "]
[]
[null,null,"2. What are the components of the tool?"]
{"$rows_left_out":47}
{"sheet":"Planned measures for reopening","index":2,"n_rows":40,"n_cols":10,"rows_kept":40,"cut":false,"hidden":false,"merged":[]}
[]
[]
[]
[]
[]
[null,null,"<Check the measures that apply to your context>",null,null,"<Specify whether the measures apply to all schools or reopened schools when color-coded>"]
[null,null,null,"Measures","Explanation of the measures","Applicable to","Cost implications",null," "]
[null,null,null,"Pillar 1: Measures related to safe operations"]
[null,null,null,"Establish cleaning and disinfecting measures","Schedule regular cleaning of the school facilities. Clean and disinfect classrooms and spaces used for instruction, common spaces, gyms, toilets, as well as frequently touched surfaces such as door handles, desks, toys, supplies, light switches, doorframes, play equipment, teaching aids used by children, and covers of books. ","Reopened schools","Increase in cost",null,null,"P101"]
[null,null,null,"Provide personal protective equipment ","Enforce the school policy on wearing a mask or a face covering in line with national or local guidance. Provide sufficient medical masks for students and personnel. Introduce students with sensory concerns/tactile sensitivities to face coverings that are most comfortable for them. ","Reopened schools","Increase in cost",null,null,"P102"]
{"$rows_left_out":31}
{"sheet":"Basic information about schools","index":3,"n_rows":107,"n_cols":19,"rows_kept":107,"cut":false,"hidden":false,"merged":[[77,3,77,5],[44,3,44,5],[42,3,42,14],[47,2,47,15],[13,3,13,14],[16,3,16,14],[19,3,19,14]]}
[]
[]
[]
[]
[null,null,null,null,null,null,null,"<Following the questions and fill out the input cells>"]
[]
[null,null,"Basic school information"]
[]
[null,null,"1. Country/economy",null,null,"India",null,"<Please choose the country/economy from the dropdown list>"]
[]
{"$rows_left_out":98}
{"sheet":"School reopening status","index":4,"n_rows":24,"n_cols":18,"rows_kept":24,"cut":false,"hidden":false,"merged":[[15,2,15,6],[7,2,7,18],[8,17,8,18],[18,2,18,18],[17,2,17,18]]}
[]
[]
[]
[]
[]
[]
[null,null,{"$f":" \"School reopening status during \"&LOWER('Basic information about schools'!D43)&\"\"","v":"School reopening status during the fall sesmeter of 2021"}]
[null,null,"<If schools or students return to in-person classes in phase, please specify the percentage of schools that provide in-person classes, the percentage of students who attend in-person classes, and the number of school days for each phase. If not, just fill out the three parameters in Phase 1.>"]
[null,null,null,null,null,null,null,"Phase 1",null,"Phase 2",null,"Phase 3",null,"Phase 4",null,"Phase 5",null,{"$f":"\"Average across \"&LOWER('Basic information about schools'!D43)&\"\"","v":"Average across the fall sesmeter of 2021"}]
[null,null,"% of schools that provide in-person classes",null,null,null,null,0.4,null,0.8,null,0.95,null,null,null,null,null,{"$f":"IF(ISERROR((pct_school_reopen_phase1 * N_school_day_phase1 + pct_school_reopen_phase2 * N_school_day_phase2 + pct_school_reopen_phase3 * N_school_day_phase3 + pct_school_reopen_phase4 * N_school_day_phase4 + pct_school_reopen_phase5 * N_school_day_phase5)/(N_school_day_phase1 + N_school_day_phase2 + N_school_day_phase3 + N_school_day_phase4 + N_school_day_phase5)), \"\", (pct_school_reopen_phase1 * N_school_day_phase1 + pct_school_reopen_phase2 * N_school_day_phase2 + pct_school_reopen_phase3 * N_school_day_phase3 + pct_school_reopen_phase4 * N_school_day_phase4 + pct_school_reopen_phase5 * N_school_day_phase5)/(N_school_day_phase1 + N_school_day_phase2 + N_school_day_phase3 + N_school_day_phase4 + N_school_day_phase5))","v":0.71666666666666667}]
{"$rows_left_out":15}
{"sheet":"Qty of additional resources","index":5,"n_rows":131,"n_cols":10,"rows_kept":131,"cut":false,"hidden":false,"merged":[[6,4,6,5],[8,2,23,2],[9,3,10,3],[11,3,12,3],[13,3,14,3],[17,3,18,3],[20,3,21,3],[28,3,29,3],[24,2,26,2],[27,2,38,2],[39,2,45,2],[49,2,54,2],[56,2,59,2],[60,2,67,2],[69,2,74,2],[76,2,82,2],[83,2,93,2],[94,2,97,2],[98,2,99,2],[100,2,101,2],[102,2,103,2],[105,2,110,2],[111,2,116,2],[119,2,124,2],[31,3,32,3],[33,3,34,3],[35,3,36,3],[37,3,38,3],[49,3,50,3],[51,3,52,3],[56,3,57,3],[58,3,59,3],[60,3,61,3],[65,3,66,3],[69,3,70,3],[71,3,72,3],[73,3,74,3],[76,3,78,3],[111,3,113,3],[114,3,115,3],[125,3,126,3],[79,3,81,3],[84,3,85,3],[86,3,87,3],[96,3,97,3],[100,3,101,3]]}
[]
[]
[]
[]
[]
[null,null,null,null,null,"<Check whether the default settings make sense to you. If not, revise based on your context>"]
[null,null,"Checked measures","Additional resources","Parameter settings",null,"Notes"]
[null,null,"Pillar 1: Actions related to safe operations"]
[null,null,"Establish cleaning and disinfecting measures","Disinfectant",null,null,"See Calculator 2.1 for details",null,null,"P101"]
[null,null,null,"Empty containers for diluting cleaning and disinfection products",1,"container(s) per cleaner (goal)"]
{"$rows_left_out":122}
{"sheet":"Calculators","index":6,"n_rows":235,"n_cols":20,"rows_kept":235,"cut":false,"hidden":false,"merged":[[85,11,85,17],[93,3,93,7],[72,11,72,17],[99,11,99,17],[80,11,80,17],[80,3,80,7],[78,11,78,17],[72,3,72,7],[78,3,78,7],[70,3,70,17],[168,2,168,17],[207,2,207,17],[129,4,129,7],[19,3,19,16],[130,4,130,7],[151,4,151,7],[152,4,152,7],[106,11,106,17],[112,3,112,7],[140,4,140,7],[141,4,141,7],[102,11,102,17],[102,4,102,7],[98,3,98,7],[92,3,92,7]]}
[]
[]
[]
[]
[null,null,null,null,null,null,null,null,null,null,null,null,"<Fill out the input cells>"]
[]
[null,null,"Calculators"]
[]
[null,null,"Table of Contents"]
[]
{"$rows_left_out":226}
{"sheet":"Prices of additional resources","index":7,"n_rows":101,"n_cols":14,"rows_kept":101,"cut":false,"hidden":false,"merged":[[75,2,76,2],[78,2,83,2],[84,2,86,2],[88,2,89,2],[90,2,95,2],[72,2,73,2],[8,2,18,2],[19,2,21,2],[22,2,28,2],[29,2,35,2],[39,2,42,2],[44,2,45,2],[46,2,51,2],[53,2,55,2],[57,2,59,2],[60,2,68,2],[69,2,71,2]]}
[]
[]
[]
[]
[]
[null,null,null,null,null,null,"<Fill out the price for each resource>",null,null,"<If you are interested in knowing the economic cost, please fill out Columns J and K>"]
[null,null,"Checked measures","Additional resources","Quantity","Unit",{"$f":"\"Price \"&IF('Basic information about schools'!G99=\"\",\"\",\"(in \"&'Basic information about schools'!G99&\")\"&\"\")","v":"Price (in MRupee)"},{"$f":"\"Total additional cost\"","v":"Total additional cost"},null,{"$f":"\"Can this resource be used beyond \"&LOWER('Basic information about schools'!D43)&\"? (Yes/No)\"","v":"Can this resource be used beyond the fall sesmeter of 2021? (Yes/No)"},"If yes, what is the expected lifetime of this resource? (In months)","Economic cost"]
[null,null,"Pillar 1: Measures related to safe operations"]
[null,null,"Establish cleaning and disinfecting measures","Disinfectant",{"$f":"Disinfectant_per_school_per_day_gap * (N_school * pct_school_reopen) * N_school_days","v":580.5},"liter(s)",1,{"$f":"E9*G9","v":580.5},null,null,null,{"$f":"IF(J9 = \"Yes\", H9/K9 * (N_school_days/20), H9)","v":580.5},null,"P101"]
[null,null,null,"Empty containers for diluting cleaning and disinfection products",{"$f":"N_container_per_cleaner * N_newly_hired_cleaner + (N_container_per_cleaner - N_container_per_cleaner_current) * N_cleaner_current * pct_teacher_staff_in_school","v":7.166666666666667},"piece(s)",100,{"$f":"E10*G10","v":716.66666666666674},null,"Yes",24,134.375]
{"$rows_left_out":92}
{"sheet":"Funding","index":8,"n_rows":23,"n_cols":6,"rows_kept":23,"cut":false,"hidden":false,"merged":[]}
[]
[]
[]
[]
[null,null,"<Specify funding available from both domestic and external sources and the % of funding subject to reallocation>"]
[]
[null,null,"Funding source","Amount available","% subject to reallocation","Total funding"]
[null,null,"Savings from the cancellation of field trips, events, and extracurricular activities",1000,1,{"$f":"D8*E8","v":1000}]
[null,null,"Savings from previous school closure",1000,1,1000]
[null,null,"External funding",160100,1,160100]
{"$rows_left_out":14}
{"sheet":"Report","index":9,"n_rows":58,"n_cols":12,"rows_kept":58,"cut":false,"hidden":false,"merged":[[53,2,53,18],[39,4,48,6],[55,2,55,18],[31,5,32,6],[31,4,32,4],[34,5,35,6],[34,4,35,4]]}
[]
[]
[]
[]
[]
[]
[null,null,"How much does it cost to reopen schools safely?"]
[]
[null,null,null,null,"Context",null,null,null,{"$f":"\"Cost, funding and financial gap to reopen schools safely during \"&LOWER('Basic information about schools'!D43)&\"\"","v":"Cost, funding and financial gap to reopen schools safely during the fall sesmeter of 2021"}]
[null,null,null,null,{"$f":"CHOOSE(Output!C3, Output!C4, Output!C5, Output!C6, Output!C7, Output!C8)","v":"Malgudi, India"},null,null,null,null,null,null,{"$f":"\"(Expressed in \"&'Basic information about schools'!G99&\" in \"&'Basic information about schools'!G101&\" values)\"","v":"(Expressed in MRupee in 2021 values)"}]
{"$rows_left_out":49}
{"sheet":"Items to purchase","index":10,"n_rows":51,"n_cols":7,"rows_kept":51,"cut":false,"hidden":false,"merged":[]}
[]
[]
[]
[]
[]
[null,null,"<A list of materials and equipment that need to be purchased is generated automatically. The quantity represents the total needs, NOT the additional resources needed>"]
[null,null,"Items to purchase (materials and equipment)","Quantity","Unit"]
[null,null,"Disinfectant",{"$f":"Disinfectant_per_school_per_day * (N_school * pct_school_reopen) * N_school_days","v":725.625},"liter(s)",null,"p101"]
[null,null,"Empty containers for diluting cleaning and disinfection products",{"$f":"N_container_per_cleaner * N_newly_hired_cleaner + (N_container_per_cleaner - N_container_per_cleaner_current) * N_cleaner_current * pct_teacher_staff_in_school","v":7.166666666666667},"piece(s)"]
[null,null,"Electrostatic disinfectant sprayers",{"$f":"N_sprayer_per_cleaner * N_newly_hired_cleaner + (N_sprayer_per_cleaner - N_sprayer_per_cleaner_current) * N_cleaner_current * pct_teacher_staff_in_school","v":7.166666666666667},"piece(s)"]
{"$rows_left_out":42}
{"sheet":"Data prep","index":11,"n_rows":38,"n_cols":4,"rows_kept":38,"cut":false,"hidden":false,"merged":[]}
[]
["Financial cost"]
[null,"Total additional cost"]
["Safe operations",{"$f":"_xlfn.AGGREGATE(9, 5, 'Prices of additional resources'!H9:H56)","v":243619.53568881337}]
["Recovering learning",{"$f":"_xlfn.AGGREGATE(9, 5, 'Prices of additional resources'!H58:H77)","v":633692.22222222225}]
["Supporting emotional wellbeing",{"$f":"_xlfn.AGGREGATE(9, 5, 'Prices of additional resources'!H79:H87)","v":51936}]
["Reaching the marginalized",{"$f":"_xlfn.AGGREGATE(9, 5, 'Prices of additional resources'!H89:H97)","v":157153.33333333334}]
["Total",{"$f":"SUM(B4:B7)","v":1086401.0912443688}]
[]
[null,"Total"]
{"$rows_left_out":29}
{"sheet":"Output","index":12,"n_rows":16,"n_cols":15,"rows_kept":16,"cut":false,"hidden":false,"merged":[]}
["Spreadsheet","Measures","Basic school information","Basic school information","Basic school information","Basic school information","Basic school information","Basic school information",null,null,"Report"]
["Parameter","Applicable to","Location","Education level: Pre-primary education","Education level: Primary education","Education level: Lower secondary education","Education level: Upper secondary education","Education level: Tertiary education","Private school included",null,"Education levels","Label of education level","Education level + grade level",null,"Filter list"]
["Value",null,2,true,true,false,false,false,1,null,{"$f":"D3","v":true},"Pre-primary education",{"$f":"_xlfn.CONCAT(L3, \" (\", 'Basic information about schools'!G35, \")\")","v":"Pre-primary education (Ages 3-5)"},null,{"$f":"_xlfn._xlws.FILTER(M3:M7, K3:K7 = TRUE, \"\")","v":"Pre-primary education (Ages 3-5)"}]
[1,"All schools, regardless of their reopening status",{"$f":"'Basic information about schools'!F9","v":"India"},"pre-primary education,","primary education,","lower secondary education,","upper secondary education,","tertiary education",null,null,{"$f":"E3","v":true},"Primary education",{"$f":"_xlfn.CONCAT(L4, \" (\", 'Basic information about schools'!G36, \")\")","v":"Primary education (K-3)"},null,"Primary education (K-3)"]
[2,"Reopened schools",{"$f":"_xlfn.CONCAT('Basic information about schools'!G27, \", \", 'Basic information about schools'!F9)","v":"Malgudi, India"},null,null,null,null,null,null,null,{"$f":"F3","v":false},"Lower secondary education",{"$f":"_xlfn.CONCAT(L5, \" (\", 'Basic information about schools'!G37, \")\")","v":"Lower secondary education ()"}]
[3,null,{"$f":"_xlfn.CONCAT('Basic information about schools'!G28, \", \", 'Basic information about schools'!F9)","v":", India"},null,null,null,null,null,null,null,{"$f":"G3","v":false},"Upper secondary education",{"$f":"_xlfn.CONCAT(L6, \" (\", 'Basic information about schools'!G38, \")\")","v":"Upper secondary education ()"}]
[4,null,{"$f":"_xlfn.CONCAT('Basic information about schools'!G29, \", \", 'Basic information about schools'!F9)","v":", India"},null,null,null,null,null,null,null,{"$f":"H3","v":false},"Tertiary education",{"$f":"_xlfn.CONCAT(L7, \" (\", 'Basic information about schools'!G39, \")\")","v":"Tertiary education ()"}]
[5,null,{"$f":"_xlfn.CONCAT('Basic information about schools'!G30, \", \", 'Basic information about schools'!F9)","v":", India"}]
[6]
[7]
{"$rows_left_out":7}
{"sheet":"List_Economy","index":13,"n_rows":287,"n_cols":11,"rows_kept":287,"cut":false,"hidden":false,"merged":[[274,0,274,8],[278,0,278,8],[280,0,280,8]]}
["World Bank list of economies (June 2020)"]
[]
["(Bold indicates a change of classification)",null,null," "]
[]
["x","x","Economy","Code","X","Region","Income group","Lending category","Other",null,"Data prep"]
["x","x","x","x","x","x","x","x","x"]
[1,null,"Afghanistan","AFG",null,"South Asia","Low income","IDA","HIPC",null,{"$f":"_xlfn._xlws.FILTER($C$7:$C$225, ISNUMBER(SEARCH('Basic information about schools'!F9, $C$7:$C$225)),\"Please check the spelling\")","v":"India"}]
[2,null,"Albania","ALB",null,"Europe & Central Asia","Upper middle income","IBRD",""]
[3,null,"Algeria","DZA",null,"Middle East & North Africa","Lower middle income","IBRD",""]
[4,null,"American Samoa","ASM",null,"East Asia & Pacific","Upper middle income","..",""]
{"$rows_left_out":277}