{"text_format":"1","workbook":"xlsx","n_sheets":13,"sheets":["Introduction","Planned measures for reopening","Basic information about schools","School reopening status","Qty of additional resources","Calculators","Prices of additional resources","Funding","Report","Items to purchase","List_Economy","Data prep","Output"],"not_rendered":{"charts":6,"images":36,"macros":1,"external_links":1,"defined_names":218,"comments":2,"pivot_tables":0},"unopened":[],"bounds":{"document_bytes":16777216,"sheet_cells":100000,"rows_first":2000,"rows_last":500,"rows_between":2000,"halvings":0,"cell_chars":16384,"cell_head_chars":4096},"cells_cut":0,"cells_raw":0,"read":"whole","date_system":"1900"}

{"sheet":"Introduction","index":0,"n_rows":51,"n_cols":16,"rows_kept":51,"cut":false,"hidden":false,"merged":[[22,7,22,9],[22,15,22,17],[50,2,50,17],[19,4,19,5],[20,4,20,5],[21,4,21,5],[22,4,22,5],[21,15,21,17],[19,7,19,9],[20,7,20,9],[19,11,19,13],[41,2,41,17],[26,2,26,17],[37,2,37,4],[38,2,38,17],[40,2,40,3],[19,15,19,17],[21,7,21,9],[6,2,6,17],[0,2,0,17],[1,2,1,17],[5,2,5,17],[13,7,13,9],[13,11,13,13],[13,15,13,17],[11,11,11,13],[11,15,11,17],[13,4,13,5],[11,7,11,9],[7,2,7,17],[14,7,14,9],[14,11,14,13],[16,11,16,13],[15,11,15,13],[14,4,14,5],[15,4,15,5],[16,4,16,5],[15,7,15,9],[16,7,16,9],[17,4,17,5],[18,4,18,5],[18,11,18,13],[20,11,20,13],[17,11,17,13],[17,7,17,9],[18,7,18,9]]}
[" ",null,"Versión 1.0\n23 de febrero de 2021"]
[null,null,"Herramienta de cálculo de costos para planes de reapertura de escuelas"]
[null,null,"Introducción"]
[]
[null,null,"1. ¿Para qué sirve esta herramienta?"]
[null,null,"Propósitos\n i) Identificar los recursos adicionales y la intensidad de uso necesaria para llevar a cabo el plan de reapertura de escuelas;\nii) calcular el costo de estos recursos adicionales y especificar el financiamiento disponible;\niii) evaluar si existe una brecha de financiamiento, y\niv) guiar la implementación del plan de reapertura de escuelas. "]
[null,null,"Destinatarios\nLa información generada por la herramienta le será útil a funcionarios de gobierno, dirigentes escolares, organizaciones y donantes internacionales implicados en la planificación, presupuestación y financiamiento de la reapertura de escuelas durante la pandemia. "]
[null,null,"Usuarios\nSugerimos que las personas que completen las planillas sean funcionarios de gobierno o dirigentes escolares encargados de calcular los presupuestos para la reapertura de escuelas. Normalmente estas personas trabajan en la unidad de presupuesto. Los investigadores, organizaciones internacionales y donantes también pueden utilizar la herramienta para proporcionar asistencia técnica a los gobiernos. "]
[]
[null,null,"2. ¿Cuáles son los componentes de la herramienta?"]
{"$rows_left_out":42}
{"sheet":"Planned measures for reopening","index":1,"n_rows":36,"n_cols":10,"rows_kept":36,"cut":false,"hidden":false,"merged":[]}
[]
[]
[]
[]
[]
[null,null,"<Verificar las medidas que aplican a su contexto>",null,null,"<Indicar si las medidas aplican a todas las escuelas o a las escuelas reabiertas cuando están codificadas por color>"]
[null,null,null,"Medidas","Explicación de las medidas","Aplican a","Consecuencias financieras",null," "]
[null,null,null,"Eje 1:  medidas relacionadas con la seguridad de las operaciones"]
[null,null,null,"Establecer medidas de limpieza y desinfección","Programar la limpieza periódica de las instalaciones educativas. Limpiar y desinfectar las aulas y los espacios utilizados para la instrucción, espacios comunes, gimnasios, baños, así como superficies que se tocan con frecuencia como picaportes, escritorios, juguetes, insumos, interruptores de luz, marcos de puertas, equipos de juego, material didáctico utilizado por los niños y portadas de los libros. ","Escuelas reabiertas","Aumento en el costo",null,null,"P101"]
[null,null,null,"Proporcionar equipos de protección personal ","Hacer cumplir la política de la escuela de utilizar una mascarilla o una máscara, en línea con las directrices nacionales o locales. Proporcionar suficientes mascarillas médicas para los alumnos y el personal. Presentarles a los alumnos con problemas sensoriales o sensibilidades táctiles las máscaras que sean más cómodas para ellos. ","Escuelas reabiertas","Aumento en el costo",null,null,"P102"]
{"$rows_left_out":27}
{"sheet":"Basic information about schools","index":2,"n_rows":103,"n_cols":19,"rows_kept":103,"cut":false,"hidden":false,"merged":[[77,3,77,5],[44,3,44,5],[42,3,42,14],[47,2,47,15],[13,3,13,14],[16,3,16,14],[19,3,19,14]]}
[]
[]
[]
[]
[null,null,null,null,null,null,null,"<Responda a las preguntas y complete las celdas de entrada>"]
[]
[null,null,"Información básica de las escuelas"]
[]
[null,null,"1. País/economía",null,null,"Storyland",null,"<Elija el país/economía de la lista desplegable>"]
[]
{"$rows_left_out":94}
{"sheet":"School reopening status","index":3,"n_rows":25,"n_cols":18,"rows_kept":25,"cut":false,"hidden":false,"merged":[[15,2,15,6],[7,2,7,18],[8,17,8,18],[18,2,18,18],[17,2,17,18],[11,2,11,6]]}
[]
[]
[]
[]
[]
[]
[null,null,{"$f":"\"School reopening status during \"&LOWER('Basic information about schools'!D43)&\"\"","v":"School reopening status during el primer semestre de 2021."}]
[null,null,"<Si las escuelas o los alumnos regresan a clases presenciales de forma escalonada, indique el porcentaje de escuelas que imparten clases presenciales, el porcentaje de alumnos que asisten a clases presenciales y el número de días de escuela para cada etapa. Caso contrario, solo complete los tres parámetros de la Fase 1.>"]
[null,null,null,null,null,null,null,"Fase 1",null,"Fase 2",null,"Fase 3",null,"Fase 4",null,"Fase 5",null,{"$f":"\"Average cross \"&LOWER('Basic information about schools'!D43)&\"\"","v":"Average cross el primer semestre de 2021."}]
[null,null,"Porcentaje de escuelas que imparten clases presenciales",null,null,null,null,0.2,null,0.4,null,0.9,null,null,null,null,null,{"$f":"IF(ISERROR((pct_school_reopen_phase1 * N_school_day_phase1 + pct_school_reopen_phase2 * N_school_day_phase2 + pct_school_reopen_phase3 * N_school_day_phase3 + pct_school_reopen_phase4 * N_school_day_phase4 + pct_school_reopen_phase5 * N_school_day_phase5)/(N_school_day_phase1 + N_school_day_phase2 + N_school_day_phase3 + N_school_day_phase4 + N_school_day_phase5)), \"\", (pct_school_reopen_phase1 * N_school_day_phase1 + pct_school_reopen_phase2 * N_school_day_phase2 + pct_school_reopen_phase3 * N_school_day_phase3 + pct_school_reopen_phase4 * N_school_day_phase4 + pct_school_reopen_phase5 * N_school_day_phase5)/(N_school_day_phase1 + N_school_day_phase2 + N_school_day_phase3 + N_school_day_phase4 + N_school_day_phase5))","v":0.5}]
{"$rows_left_out":16}
{"sheet":"Qty of additional resources","index":4,"n_rows":127,"n_cols":10,"rows_kept":127,"cut":false,"hidden":false,"merged":[[111,3,113,3],[114,3,115,3],[125,3,126,3],[79,3,81,3],[84,3,85,3],[86,3,87,3],[96,3,97,3],[100,3,101,3],[111,2,116,2],[119,2,124,2],[31,3,32,3],[33,3,34,3],[35,3,36,3],[37,3,38,3],[49,3,50,3],[51,3,52,3],[56,3,57,3],[58,3,59,3],[60,3,61,3],[65,3,66,3],[69,3,70,3],[71,3,72,3],[73,3,74,3],[76,3,78,3],[94,2,97,2],[98,2,99,2],[100,2,101,2],[102,2,103,2],[105,2,110,2],[56,2,59,2],[60,2,67,2],[69,2,74,2],[76,2,82,2],[83,2,93,2],[28,3,29,3],[24,2,26,2],[27,2,38,2],[39,2,45,2],[49,2,54,2],[6,4,6,5],[8,2,23,2],[9,3,10,3],[11,3,12,3],[13,3,14,3],[17,3,18,3],[20,3,21,3]]}
[]
[]
[]
[]
[]
[null,null,null,null,null,"<Verificar si la configuración predeterminada tiene sentido para usted. Caso contrario, revísela en base a su contexto.>"]
[null,null,"Medidas verificadas","Recursos adicionales","Configuración de los parámetros",null,"Notas"]
[null,null,"Eje 1: medidas relacionadas con la seguridad de las operaciones"]
[null,null,"Establecer medidas de limpieza y desinfección","Desinfectante",null,null,"Ver Calculadora 2.1 para más detalles",null,null,"P101"]
[null,null,null,"Contenedores vacíos para diluir los productos de limpieza y desinfección",1,"contenedor(es) por limpiador (objetivo)"]
{"$rows_left_out":118}
{"sheet":"Calculators","index":5,"n_rows":224,"n_cols":20,"rows_kept":224,"cut":false,"hidden":false,"merged":[[168,2,168,17],[207,2,207,17],[129,4,129,7],[19,3,19,16],[130,4,130,7],[151,4,151,7],[152,4,152,7],[106,11,106,17],[112,3,112,7],[140,4,140,7],[141,4,141,7],[102,11,102,17],[102,4,102,7],[98,3,98,7],[92,3,92,7],[85,11,85,17],[93,3,93,7],[72,11,72,17],[99,11,99,17],[80,11,80,17],[80,3,80,7],[78,11,78,17],[72,3,72,7],[78,3,78,7]]}
[]
[]
[]
[]
[null,null,null,null,null,null,null,null,null,null,null,null,"<Completar las celdas de entrada>"]
[]
[null,null,"Calculadoras"]
[]
[null,null,"Índice"]
[]
{"$rows_left_out":215}
{"sheet":"Prices of additional resources","index":6,"n_rows":101,"n_cols":14,"rows_kept":101,"cut":false,"hidden":false,"merged":[[72,2,73,2],[8,2,18,2],[19,2,21,2],[22,2,28,2],[29,2,35,2],[39,2,42,2],[44,2,45,2],[46,2,51,2],[53,2,55,2],[57,2,59,2],[60,2,68,2],[69,2,71,2],[75,2,76,2],[78,2,83,2],[84,2,86,2],[88,2,89,2],[90,2,95,2]]}
[]
[]
[]
[]
[]
[null,null,null,null,null,null,"<Ingresar el precio de cada recurso>",null,null,"<Si le interesa conocer el costo económico, complete las columnas J y K>"]
[null,null,"Medidas verificadas","Recursos adicionales","Cantidad","Unidad",{"$f":"\"Price \"&IF('Basic information about schools'!G99=\"\",\"\",\"(in \"&'Basic information about schools'!G99&\")\"&\"\")","v":"Price (in Bea)"},{"$f":"\"Total additional cost\"","v":"Total additional cost"},null,{"$f":"\"Can this resource be used beyond \"&LOWER('Basic information about schools'!D43)&\"? (Yes/No)\"","v":"Can this resource be used beyond el primer semestre de 2021.? (Yes/No)"},"Si la respuesta es sí, ¿cuál es la vida útil prevista para este recurso? (en meses)","Costo económico"]
[null,null,"Eje 1: medidas relacionadas con la seguridad de las operaciones"]
[null,null,"Establecer medidas de limpieza y desinfección","Desinfectante",{"$f":"Disinfectant_per_school_per_day_gap * (N_school * pct_school_reopen) * N_school_days","v":2025},"litro(s)",1,{"$f":"E9*G9","v":2025},null,null,null,{"$f":"IF(J9 = \"Yes\", H9/K9 * (N_school_days/20), H9)","v":2025},null,"P101"]
[null,null,null,"Contenedores vacíos para diluir los productos de limpieza y desinfección",{"$f":"N_container_per_cleaner * N_newly_hired_cleaner + (N_container_per_cleaner - N_container_per_cleaner_current) * N_cleaner_current * pct_teacher_staff_in_school","v":35},"pieza(s)",100,{"$f":"E10*G10","v":3500},null,"Sí",24,3500]
{"$rows_left_out":92}
{"sheet":"Funding","index":7,"n_rows":19,"n_cols":6,"rows_kept":19,"cut":false,"hidden":false,"merged":[]}
[]
[]
[]
[]
[null,null,"<Indique el financiamiento disponible de fuentes domésticas y externas y el porcentaje de financiamiento sujeto a reasignación>"]
[]
[null,null,"Fuente de financiamiento","Monto disponible","Porcentaje sujeto a reasignación","Financiamiento total"]
[null,null,"Ahorro derivado de cancelar las excursiones, eventos y actividades extracurriculares",10000,1,{"$f":"D8*E8","v":10000}]
[null,null,"Ahorro del anterior cierre escolar",10000,1,10000]
[null,null,"Financiamiento externo",101000,1,101000]
{"$rows_left_out":10}
{"sheet":"Report","index":8,"n_rows":57,"n_cols":12,"rows_kept":57,"cut":false,"hidden":false,"merged":[[8,8,8,18],[22,8,22,18],[54,2,54,18],[39,4,49,6],[56,2,56,18],[31,5,32,6],[31,4,32,4],[34,5,35,6],[34,4,35,4]]}
[]
[]
[]
[]
[]
[]
[null,null,{"$f":"\"How much does it cost to reopen schools safely\"&IF('Basic information about schools'!F9 <>\"\", \" in \"&'Basic information about schools'!F9&\"\", \"\")&\"?\"","v":"How much does it cost to reopen schools safely in Storyland?"}]
[]
[null,null,null,null,"Contexto",null,null,null,{"$f":"\"Costo, financiamiento y brecha financiera de reabrir las escuelas de forma segura durante el segundo semestre de \"&LOWER('Basic information about schools'!D43)&\"\"","v":"Costo, financiamiento y brecha financiera de reabrir las escuelas de forma segura durante el segundo semestre de el primer semestre de 2021."}]
[null,null,null,null,{"$f":"CHOOSE(Output!C3, Output!C4, Output!C5, Output!C6, Output!C7, Output!C8)","v":"Región Neverland"},null,null,null,null,null,null,{"$f":"\"(Expressed in \"&'Basic information about schools'!G99&\" in \"&'Basic information about schools'!G101&\" values)\"","v":"(Expressed in Bea in 2021 values)"}]
{"$rows_left_out":48}
{"sheet":"Items to purchase","index":9,"n_rows":47,"n_cols":7,"rows_kept":47,"cut":false,"hidden":false,"merged":[]}
[]
[]
[]
[]
[]
[null,null,"<Se genera automáticamente una lista con los materiales y equipos que deben adquirirse. La cantidad representa las necesidades totales, NO los recursos adicionales necesarios>"]
[null,null,"Artículos que se deben adquirir (materiales y equipos)","Cantidad","Unidad"]
[null,null,"Desinfectante",{"$f":"Disinfectant_per_school_per_day * (N_school * pct_school_reopen) * N_school_days","v":2531.25},"litro(s)",null,"p101"]
[null,null,"Contenedores vacíos para diluir los productos de limpieza y desinfección",{"$f":"N_container_per_cleaner * N_newly_hired_cleaner + (N_container_per_cleaner - N_container_per_cleaner_current) * N_cleaner_current * pct_teacher_staff_in_school","v":35},"pieza(s)"]
[null,null,"pulverizadores con desinfectantes electrostáticos",{"$f":"N_sprayer_per_cleaner * N_newly_hired_cleaner + (N_sprayer_per_cleaner - N_sprayer_per_cleaner_current) * N_cleaner_current * pct_teacher_staff_in_school","v":35},"pieza(s)"]
{"$rows_left_out":38}
{"sheet":"List_Economy","index":10,"n_rows":290,"n_cols":11,"rows_kept":290,"cut":false,"hidden":true,"merged":[[274,0,274,8],[278,0,278,8],[280,0,280,8]]}
["Lista de economías del Banco Mundial (junio de 2020)"]
[]
["(Las negritas indican un cambio en la clasificación)",null,null," "]
[]
["x","x","Economía","Code","X","Region","Income group","Lending category","Other",null,"Data prep"]
["x","x","x","x","x","x","x","x","x"]
[1,null,"Afganistán","AFG",null,"South Asia","Low income","IDA","HIPC",null,{"$f":"_xlfn._xlws.FILTER($C$7:$C$225, ISNUMBER(SEARCH('Basic information about schools'!F9, $C$7:$C$225)),\"Please check the spelling\")","v":"Storyland"}]
[2,null,"Albania","ALB",null,"Europe & Central Asia","Upper middle income","IBRD",""]
[3,null,"Alemania","DZA",null,"Middle East & North Africa","Lower middle income","IBRD",""]
[4,null,"Andorra","ASM",null,"East Asia & Pacific","Upper middle income","..",""]
{"$rows_left_out":281}
{"sheet":"Data prep","index":11,"n_rows":34,"n_cols":4,"rows_kept":34,"cut":false,"hidden":true,"merged":[]}
[]
["Financial cost"]
[null,"Total additional cost"]
["Safe operations",{"$f":"_xlfn.AGGREGATE(9, 5, 'Prices of additional resources'!H9:H56)","v":735467.31715909997}]
["Sustaining learning",{"$f":"_xlfn.AGGREGATE(9, 5, 'Prices of additional resources'!H58:H77)","v":1623266.3333333333}]
["Supporting emotional wellbeing",{"$f":"_xlfn.AGGREGATE(9, 5, 'Prices of additional resources'!H79:H87)","v":382234}]
["Reaching the marginalized",{"$f":"_xlfn.AGGREGATE(9, 5, 'Prices of additional resources'!H89:H97)","v":608420}]
["Total",{"$f":"SUM(B4:B7)","v":3349387.6504924335}]
[]
[null,"Total"]
{"$rows_left_out":25}
{"sheet":"Output","index":12,"n_rows":17,"n_cols":15,"rows_kept":17,"cut":false,"hidden":true,"merged":[]}
["Spreadsheet","Measures","Basic school information","Basic school information","Basic school information","Basic school information","Basic school information","Basic school information",null,null,"Report"]
["Parameter","Applicable to","Location","Education level: Pre-primary education","Education level: Primary education","Education level: Lower secondary education","Education level: Upper secondary education","Education level: Tertiary education","Private school included",null,"Education levels","Label of education level","Education level + grade level",null,"Filter list"]
["Value",null,2,true,true,false,false,false,1,null,{"$f":"D3","v":true},"Educación preescolar",{"$f":"_xlfn.CONCAT(L3, \" (\", 'Basic information about schools'!G35, \")\")","v":"Educación preescolar (Edad 3-5)"},null,{"$f":"_xlfn._xlws.FILTER(M3:M7, K3:K7 = TRUE, \"\")","v":"Educación preescolar (Edad 3-5)"}]
[1,"Todas las escuelas, independientemente de su estado de reapertura",{"$f":"'Basic information about schools'!F9","v":"Storyland"},"educación preescolar,","educación primaria,","educación secundaria inferior,","educación secundaria superior,","educación terciaria",null,null,{"$f":"E3","v":true},"Educación primaria",{"$f":"_xlfn.CONCAT(L4, \" (\", 'Basic information about schools'!G36, \")\")","v":"Educación primaria (Jardín a 3.º)"},null,"Educación primaria (Jardín a 3.º)"]
[2,"Escuelas reabiertas",{"$f":"'Basic information about schools'!G27","v":"Región Neverland"},null,null,null,null,null,null,null,{"$f":"F3","v":false},"Educación secundaria inferior",{"$f":"_xlfn.CONCAT(L5, \" (\", 'Basic information about schools'!G37, \")\")","v":"Educación secundaria inferior ()"}]
[3,null,{"$f":"'Basic information about schools'!G28","v":0},null,null,null,null,null,null,null,{"$f":"G3","v":false},"Educación secundaria superior",{"$f":"_xlfn.CONCAT(L6, \" (\", 'Basic information about schools'!G38, \")\")","v":"Educación secundaria superior ()"}]
[4,null,{"$f":"'Basic information about schools'!G29","v":0},null,null,null,null,null,null,null,{"$f":"H3","v":false},"Educación terciaria",{"$f":"_xlfn.CONCAT(L7, \" (\", 'Basic information about schools'!G39, \")\")","v":"Educación terciaria ()"}]
[5,null,{"$f":"'Basic information about schools'!G30","v":0}]
[6]
[7]
{"$rows_left_out":7}